{"text_format":"3","workbook":"xlsx","n_sheets":15,"sheets":["Tool","Translations","Messages","Comments","Financiële balans","Hyp","General Data","Tech Data","Energy Data","Eco Data","Calculs","A-7sur7","B-5sur7","C-5sur7HVS","D-7sur7HVS"],"not_rendered":{"charts":1,"images":2,"macros":1,"defined_names":143,"comments":10},"read":"whole","date_system":"1900"}

{"sheet":"Tool","index":0,"n_rows":69,"n_cols":9,"rows_kept":69,"merged":[[3,0,3,8],[4,0,4,3],[4,5,4,8],[5,0,5,3],[6,7,6,8],[10,13,11,13],[28,0,28,4],[28,5,28,8],[31,2,31,3],[44,2,44,3],[52,2,52,3]]}
[]
["Kies uw taal / Choisissez votre langue :","Ú","FR",{"$f":"MATCH(C2,Translations!$C$1:$AA$1,0)+1","v":3}]
[]
[{"$f":"VLOOKUP(\"title_tool\",Translations,LANG,FALSE)","v":"Outil de pré-dimensionnement d'un grand système solaire thermique de production d'eau chaude"}]
[{"$f":"VLOOKUP(\"ALGEMENE INFORMATIE\",Translations,LANG,FALSE)","v":"INFORMATION GENERALES"},{"$nulls":4},{"$f":"VLOOKUP(\"BEREKENINGSHYPOTHESEN\",Translations,LANG,FALSE)","v":"HYPOTHESES DE CALCUL"}]
[]
[{"$f":"VLOOKUP(\"[Vestigingsnaam] :\",Translations,LANG,FALSE)","v":"[Nom Etablissement] :"},{"$nulls":5},{"$f":"VLOOKUP(\"Gebruikte energiedrager voor de warmwaterproductie\",Translations,LANG,FALSE)","v":"Vecteur énergétique utilisé pour la production d'eau chaude"},{"$f":"IF(ISBLANK(C43),'Eco Data'!A5,Tool!C43)","v":"3-Gaz naturel (RBC)"}]
[{"$f":"VLOOKUP(\"[Sector] :\",Translations,LANG,FALSE)","v":"[Secteur] :"},{"$nulls":5},{"$f":"VLOOKUP(\"Warmwaterketelrendement\",Translations,LANG,FALSE)","v":"Rendement utile de production d'eau chaude par l'appoint"},{"$f":"IF(Calculs!B25,Calculs!B26,Calculs!C26)","v":{"v":0.7507013000401674,"d":"75%"}}]
[{"$f":"VLOOKUP(\"[Adres] : \",Translations,LANG,FALSE)","v":"[Adresse] : "},{"$nulls":5},""]
[{"$f":"VLOOKUP(\"[Gemeente] :\",Translations,LANG,FALSE)","v":"[Localité] :"},{"$nulls":5},{"$f":"VLOOKUP(\"Referentiewarmwaterverbruik\",Translations,LANG,FALSE)","v":"Consommation d'eau chaude de référence"},{"$f":"IF(OR(ISBLANK(C32),ISBLANK(C33)),\"\",Calculs!C6)","v":0.18},{"$f":"VLOOKUP(\"m³/dag op 60°C\",Translations,LANG,FALSE)","v":"m³/jour à 60°C"}]
{"$rows_left_out":60}
{"sheet":"Translations","index":1,"n_rows":266,"n_cols":6,"rows_kept":266,"hidden":true}
["Paste this entry \"as value\" and recplace # with =","Key","NL","FR","EN","DE"]
[{"$f":"\"#VLOOKUP(\" & \"\"\"\" & B2 & \"\"\"\" & \";Translations;LANG;FALSE)\"","v":"#VLOOKUP(\"version\";Translations;LANG;FALSE)"},"version","Versie","Version"]
[{"$f":"\"#VLOOKUP(\" & \"\"\"\" & B3 & \"\"\"\" & \";Translations;LANG;FALSE)\"","v":"#VLOOKUP(\"title_tool\";Translations;LANG;FALSE)"},"title_tool","Quickscan voor de predimensionering van een groot zonthermisch systeem voor de productie van warm water","Outil de pré-dimensionnement d'un grand système solaire thermique de production d'eau chaude"]
[{"$f":"\"#VLOOKUP(\" & \"\"\"\" & B4 & \"\"\"\" & \";Translations;LANG;FALSE)\"","v":"#VLOOKUP(\"ALGEMENE INFORMATIE\";Translations;LANG;FALSE)"},{"$f":"C4","v":"ALGEMENE INFORMATIE"},"ALGEMENE INFORMATIE","INFORMATION GENERALES"]
[{"$f":"\"#VLOOKUP(\" & \"\"\"\" & B5 & \"\"\"\" & \";Translations;LANG;FALSE)\"","v":"#VLOOKUP(\"[Vestigingsnaam] :\";Translations;LANG;FALSE)"},{"$f":"C5","v":"[Vestigingsnaam] :"},"[Vestigingsnaam] :","[Nom Etablissement] :"]
["#VLOOKUP(\"[Sector] :\";Translations;LANG;FALSE)","[Sector] :","[Sector] :","[Secteur] :"]
["#VLOOKUP(\"[Adres] : \";Translations;LANG;FALSE)","[Adres] : ","[Adres] : ","[Adresse] : "]
["#VLOOKUP(\"[Gemeente] :\";Translations;LANG;FALSE)","[Gemeente] :","[Gemeente] :","[Localité] :"]
["#VLOOKUP(\"[Postcode] : \";Translations;LANG;FALSE)","[Postcode] : ","[Postcode] : ","[Code Postal] : "]
["#VLOOKUP(\"[Contactpersoon] :\";Translations;LANG;FALSE)","[Contactpersoon] :","[Contactpersoon] :","[Personne de contact] :"]
{"$rows_left_out":257}
{"sheet":"Messages","index":2,"n_rows":18,"n_cols":12,"rows_kept":18,"hidden":true}
[{"$nulls":8},"Macro work, do not touch:","Selected key:","Title","Tekst"]
["Each cell with input validation messagage should have a named range with as name a value in this column. ",{"$nulls":8},"LANG",{"$f":"IFERROR(  IF(LEN(VLOOKUP(SelCell,A4:K356,2,FALSE))>0,VLOOKUP(SelCell,A4:K356,2,FALSE), \"\"),\"\")","v":""},{"$f":"IFERROR(VLOOKUP(SelCell,A4:K356,3,FALSE),\"\")","v":""}]
["Named Range","Title input message","Tekst input messge"]
["_MsgTypeReq",null,{"$f":"VLOOKUP(\"woontypes_verplicht\",Translations,LANG,FALSE)","v":"Champ obligatoire. \nSi l'établissement ne correspond à aucun des types proposés, utiliser 'autre établissement'"}]
["_MsgAppar",null,{"$f":"VLOOKUP(\"Enkel voor appartementsgebouwen\",Translations,LANG,FALSE)","v":"Uniquement pour les immeubles à appartements"}]
["_MsgTauxOcc",null,{"$f":"VLOOKUP(\"De standaard gebruikte bezettingsgraad is 100%\",Translations,LANG,FALSE)","v":"Le taux d'occupation utilisé par défaut est de 100%"}]
["_MsgSurface",null,{"$f":"VLOOKUP(\"Vloeroppervlakte inclusief buitenmuren\",Translations,LANG,FALSE)","v":"Surface de plancher, murs extérieurs inclus"}]
["_MsgPlat",null,{"$f":"VLOOKUP(\"De daken met een helling tussen 0 en 10° dienen als platte daken beschouwd te worden\",Translations,LANG,FALSE)","v":"Les toitures présentant une inclinaison comprise entre 0 et 10° sont assimilées à des toitures plates."}]
["_MsgToitObst",null,{"$f":"VLOOKUP(\"Vul dit veld in als de nuttige dakoppervlakte (zonder schaduw of obstakels) kleiner is dan 90% van de nodige optimale dakoppervlakte.\",Translations,LANG,FALSE)","v":"A remplir si la surface de toiture utile (sans obstacles ni ombrage) est inférieure à 90% de la surface de toiture nécessaire à l'optimum "}]
["_MsgTotOrien",null,{"$f":"VLOOKUP(\"Indien hellend dak : oriëntatie van de helling die het best is blootgesteld aan het zuiden.\nIndien plat dak : oriëntatie van de gevel die het best naar het zuiden gericht is.\nDe standaard oriëntatie is pal in het zuiden.\",Translations,LANG,FALSE)","v":"Si \"Toiture inclinée\" : orientation du pan le mieux exposé.\nSi \"Toiture plate\" : orientation de la façade la plus proche du Sud.\nL'orientation utilisée par défaut est plein Sud."}]
{"$rows_left_out":9}
{"sheet":"Comments","index":3,"n_rows":10,"n_cols":3,"rows_kept":10,"hidden":true}
[]
["Each cell with a comment should have a named range with as name a value in this column. "]
["Named Range","(Title)","Tekst"]
["_Cmt_Actualisation",null,{"$f":"VLOOKUP(\"5,5 % standaardwaarde\",Translations,LANG,FALSE)","v":"5,5 % par défaut"}]
["_Cmt_Orient",null,{"$f":"VLOOKUP(\"Standaardwaarde: 0° = zuid\",Translations,LANG,FALSE)","v":"Par défaut : 0° = sud"}]
["_Cmt_InclOptim",null,{"$f":"VLOOKUP(\"OptimaleHellingsgraad\",Translations,LANG,FALSE)","v":"Sur une toiture plate (0 à 10° d'inclinaison), l'inclinaison des capteurs est optimalisée en fonction de la donnée \"Orientation de la toiture\"."}]
["_Cmt_LossesStock",null,{"$f":"VLOOKUP(\"Opslagverliezen afgetrokken\",Translations,LANG,FALSE)","v":"Pertes de stockage déduites"}]
["_Cmt_RendProd",null,{"$f":"VLOOKUP(\"Rekening houdend met het rendement van het productiepark voor elektriciteit en het elektrisch verbruik van de randapparatuur\",Translations,LANG,FALSE)","v":"Compte tenu du rendement du parc de production d'électricité et de la consommation électrique des auxilliaires."}]
["_Cmt_ElecAux",null,{"$f":"VLOOKUP(\"Kost van het elektriciteitsverbruik van de randapparatuur + onderhoudskosten\",Translations,LANG,FALSE)","v":"Coût de la consommation des auxiliaires + coût de  maintenance."}]
["_Cmt_PrixEn",null,{"$f":"VLOOKUP(\"Houdt geen rekening met de stijging van de energieprijs\",Translations,LANG,FALSE)","v":"Ne tient pas compte de l'augmentation du prix de l'énergie"}]
{"$rows_left_out":1}
{"sheet":"Financiële balans","index":4,"n_rows":48,"n_cols":14,"rows_kept":48,"hidden":true}
[]
["GEGEVENS"]
[]
["Actualisatievoet","[%]",{"$f":"IF(ISBLANK(Tool!C56)*OR(Tool!C56=0),Hyp!B8,Tool!C56/100)","v":{"v":0.055,"d":"5.50%"}}]
["Energieprijsstijging","[%]",{"$f":"IF(ISBLANK(Tool!C64),LOOKUP(Tool!H7,SourceEnergie,EvoluPxE),Tool!C64/100)","v":{"v":0.0587,"d":"5.87%"}}]
["Inflatiepercentage (indicatief, niet gebruikt in de financiele berekening)","[%]",{"$f":"Hyp!B7","v":{"v":0.022,"d":"2.20%"}}]
[]
["Netto inv na subsidies en belastingaftrek",{"$f":"Tool!I58","v":"EUR TVAc"},{"$f":"IFERROR(Tool!H58,\"\")","v":{"v":37220.31391397327,"d":"37,220"}}]
["Besparing in jaar 1",{"$f":"Tool!I59","v":"EUR TVAc"},{"$f":"Tool!H59","v":{"v":885.9329694360379,"d":"886"}}]
["Operationele kosten",{"$f":"Tool!I55","v":"EUR TVAc"},{"$f":"IFERROR(Tool!H55,\"\")","v":{"v":104.09256240519998,"d":"104"}}]
{"$rows_left_out":39}
{"sheet":"Hyp","index":5,"n_rows":30,"n_cols":8,"rows_kept":30,"hidden":true}
["Evolution prix énergies","low BFP","medium BFP","High BFP","Energy Trend 2030","Hyp ARGRBC études de faisabilité PEB (2008)"]
["augmentation annuelle du prix de l'électricité (%)",{"v":0,"d":"0.00%"},{"v":0.0347,"d":"3.47%"},{"v":0.0587,"d":"5.87%"},{"$f":"E3","v":{"v":0.02860932833558384,"d":"2.86%"}},{"$f":"D2","v":{"v":0.0587,"d":"5.87%"}},null,"Source: http://www.bruxellesenvironnement.be/uploadedFiles/Contenu_du_site/Professionnels/Themes/Énergie/01_PEB_et_climat_intérieur/01Travaux_PEB/01_Qu_est_ce_que_les_travaux_PEB/AMB20080724_hypotheses_energetiques_PEB.pdf?langtype=2060 "]
["augmentation annuelle du prix du gaz (%)",{"v":0,"d":"0.00%"},{"v":0.0347,"d":"3.47%"},{"v":0.0587,"d":"5.87%"},{"v":0.02860932833558384,"d":"2.86%"},{"$f":"D3","v":{"v":0.0587,"d":"5.87%"}},null,"Source: http://www.bruxellesenvironnement.be/uploadedFiles/Contenu_du_site/Professionnels/Themes/Énergie/01_PEB_et_climat_intérieur/01Travaux_PEB/01_Qu_est_ce_que_les_travaux_PEB/AMB20080724_hypotheses_energetiques_PEB.pdf?langtype=2061"]
["augmentation annuelle du prix du mazout (%)",{"v":0,"d":"0.00%"},{"v":0.0148,"d":"1.48%"},{"v":0.0326,"d":"3.26%"},{"v":0.020246275462935667,"d":"2.02%"},{"$f":"D4","v":{"v":0.0326,"d":"3.26%"}},null,"Source: http://www.bruxellesenvironnement.be/uploadedFiles/Contenu_du_site/Professionnels/Themes/Énergie/01_PEB_et_climat_intérieur/01Travaux_PEB/01_Qu_est_ce_que_les_travaux_PEB/AMB20080724_hypotheses_energetiques_PEB.pdf?langtype=2062"]
["augmentation annuelle du prix des pellets",{"v":0,"d":"0.00%"},null,{"$f":"D4","v":{"v":0.0326,"d":"3.26%"}},{"$f":"E4","v":{"v":0.020246275462935667,"d":"2.02%"}},{"$f":"D5","v":{"v":0.0326,"d":"3.26%"}}]
[]
["Inflation",{"v":0.022,"d":"2.20%"}]
["Taux d'actualisation",{"$f":"0.055","v":{"v":0.055,"d":"5.5%"}}]
["Durée de vie économique de l'installation",25,"ans"]
[]
{"$rows_left_out":21}
{"sheet":"General Data","index":6,"n_rows":55,"n_cols":6,"rows_kept":55,"hidden":true}
["Secteur"]
[null,{"$f":"VLOOKUP(\"Privaat\",Translations,LANG,FALSE)","v":"Privé"}]
[null,{"$f":"VLOOKUP(\"Publiek\",Translations,LANG,FALSE)","v":"Public"}]
[]
["O_N"]
[null,{"$f":"VLOOKUP(\"Nee\",Translations,LANG,FALSE)","v":"Non"}]
[null,{"$f":"VLOOKUP(\"Ja\",Translations,LANG,FALSE)","v":"Oui"}]
[]
["CategoriePEB"]
["1.16","Autre affectation"]
{"$rows_left_out":46}
{"sheet":"Tech Data","index":7,"n_rows":66,"n_cols":41,"rows_kept":66,"hidden":true}
[]
[]
[]
[]
[]
[]
["Toit",null,"InclinOpt","FactCorr","OrientOpt","ST_Scoll"]
[null,{"$f":"VLOOKUP(\"Hellend dak\",Translations,LANG,FALSE)","v":"Toiture inclinée"},{"$f":"X13","v":{"v":45,"d":"45°"}},{"$f":"Y17","v":{"v":1.2833865758009408,"d":"1.28"}},{"$f":"X14","v":"1-Est"},{"$f":"C23","v":1.2}]
[null,{"$f":"VLOOKUP(\"Plat dak\",Translations,LANG,FALSE)","v":"Toiture plate"},{"$f":"Z20","v":{"v":10,"d":"10°"}},{"$f":"Z19","v":{"v":1.1442581292524734,"d":"1.14"}},{"$f":"X14","v":"1-Est"},{"$f":"C24","v":3.35},{"$nulls":17},"SDR geen vertaling"]
[]
{"$rows_left_out":57}
{"sheet":"Energy Data","index":8,"n_rows":38,"n_cols":9,"rows_kept":38,"hidden":true}
[]
["UnitéComb","kWh/an"]
[null,"l/an"]
[null,"m³/an"]
[null,"t/an"]
["Conversion Unités"]
[null,1,"GJ ",{"v":277.77777778,"d":"277.78"},"kWh"]
[null,1,"MJ ",{"v":0.27777777778,"d":"0.28"},"kWh"]
[null,1,"kWh ",{"v":3.6,"d":"3.60"},"MJ"]
[null,1,"kcal",1.163,"Wh"]
{"$rows_left_out":29}
{"sheet":"Eco Data","index":9,"n_rows":48,"n_cols":28,"rows_kept":48,"hidden":true,"merged":[[22,15,22,19]]}
[]
["SourceEnergie","UnitéConsoAn ","RdtUtilAtm","RdtUtilOld","RdtUtilNew","RdtUtilCond","PCI","Unité PCI","FactConv MJ","(MJ/unité)","FactConvEprim","FactEmis","unité","Emission CO2","unité","Prix HTVA (2012-S1)","UnitéPrix","PrixDéfaut","UnitéPrixDéfaut HTVA","PrixDéfautTVAc","UnitéPrixDéfaut TVAc","Facteur conversion defaut/kWh","Prix_kWh","UnitéPrix_kWh","Prix_kWh_TVAc","UnitéPrix_kWh_TVAc","Prix moyen hyp High BFP [EUR/kWh]","EvoluPxE"]
[{"$f":"VLOOKUP(\"1-Elektriciteit (BHG)\",Translations,LANG,FALSE)","v":"1-Electricité (RBC)"},{"$f":"VLOOKUP(\"kWh/jaar\",Translations,LANG,FALSE)","v":"kWh/an"},{"$f":"'Tech Data'!G27","v":{"v":0.6061626536453948,"d":"0.61"}},{"$f":"'Tech Data'!G27","v":{"v":0.6061626536453948,"d":"0.61"}},{"$f":"'Tech Data'!G27","v":{"v":0.6061626536453948,"d":"0.61"}},{"$f":"'Tech Data'!G27","v":{"v":0.6061626536453948,"d":"0.61"}},{"$f":"'Energy Data'!B17","v":{"v":3.6,"d":"3.60"}},"MJ/kWh",{"$f":"'Energy Data'!B17/'Energy Data'!B38","v":{"v":8.91089108910891,"d":"8.9"}},"MJ/kWh",{"$f":"'Energy Data'!B38","v":{"v":0.404,"d":"0.40"}},{"$f":"'Energy Data'!D17","v":0.395},"kg/kWh",{"$f":"L3","v":0.395},"kg/kwh",0.1456,"EUR/kWh",{"$f":"P3","v":0.1456},{"$f":"VLOOKUP(\"EUR/kWh BTW excl\",Translations,LANG,FALSE)","v":"EUR/kWh HTVA"},{"$f":"R3*1.21","v":{"v":0.176176,"d":"0.1762"}},{"$f":"VLOOKUP(\"EUR/kWh BTW incl\",Translations,LANG,FALSE)","v":"EUR/kWh TVAc"},{"v":1,"d":"1.000"},{"$f":"V3*R3","v":0.1456},{"$f":"VLOOKUP(\"EUR/kWh BTW excl\",Translations,LANG,FALSE)","v":"EUR/kWh HTVA"},{"$f":"W3*1.21","v":{"v":0.176176,"d":"0.1762"}},{"$f":"VLOOKUP(\"EUR/kWh BTW incl\",Translations,LANG,FALSE)","v":"EUR/kWh TVAc"},{"$f":"W3*((1+Hyp!D2)^25)/2","v":{"v":0.30300807774624966,"d":"0.30"}},{"$f":"Hyp!D2","v":0.0587}]
[{"$f":"VLOOKUP(\"2-Electriciteit (WG)\",Translations,LANG,FALSE)","v":"2-Electricité (RW)"},{"$f":"VLOOKUP(\"kWh/jaar\",Translations,LANG,FALSE)","v":"kWh/an"},{"$f":"'Tech Data'!G27","v":{"v":0.6061626536453948,"d":"0.61"}},{"$f":"'Tech Data'!G27","v":{"v":0.6061626536453948,"d":"0.61"}},{"$f":"'Tech Data'!G27","v":{"v":0.6061626536453948,"d":"0.61"}},{"$f":"'Tech Data'!G27","v":{"v":0.6061626536453948,"d":"0.61"}},{"$f":"'Energy Data'!B18","v":{"v":3.6,"d":"3.60"}},"MJ/kWh",{"$f":"I3","v":{"v":8.91089108910891,"d":"8.9"}},"MJ/kWh",{"$f":"K3","v":{"v":0.404,"d":"0.40"}},{"$f":"'Energy Data'!D18","v":0.456},"kg/kWh",{"$f":"L4","v":0.456},"kg/kwh",0.1456,"EUR/kWh",{"$f":"P4","v":0.1456},{"$f":"VLOOKUP(\"EUR/kWh BTW excl\",Translations,LANG,FALSE)","v":"EUR/kWh HTVA"},{"$f":"R4*1.21","v":{"v":0.176176,"d":"0.1762"}},{"$f":"VLOOKUP(\"EUR/kWh BTW incl\",Translations,LANG,FALSE)","v":"EUR/kWh TVAc"},{"v":1,"d":"1.000"},0.1456,"EUR/kWh HTVA",{"v":0.176176,"d":"0.1762"},"EUR/kWh TVAc",{"$f":"W4*((1+Hyp!D2)^25)/2","v":{"v":0.30300807774624966,"d":"0.30"}},{"$f":"Hyp!D2","v":0.0587}]
[{"$f":"VLOOKUP(\"3-Aardgas (BHG)\",Translations,LANG,FALSE)","v":"3-Gaz naturel (RBC)"},{"$f":"VLOOKUP(\"kWh/jaar\",Translations,LANG,FALSE)","v":"kWh/an"},{"$f":"'Tech Data'!G28","v":{"v":0.6061626536453948,"d":"0.61"}},{"$f":"'Tech Data'!G28","v":{"v":0.6061626536453948,"d":"0.61"}},{"$f":"'Tech Data'!G29","v":{"v":0.6954032665431892,"d":"0.70"}},{"$f":"'Tech Data'!G30","v":{"v":0.8832837435758722,"d":"0.88"}},{"$f":"'Energy Data'!B24","v":9.25},"kWh/m³",{"$f":"'Energy Data'!B26","v":{"v":3.6000000000000005,"d":"3.6"}},"MJ/kWh",{"v":1,"d":"1.00"},{"$f":"'Energy Data'!D24","v":0.217},"kg/kWh",{"$f":"L5*'Energy Data'!B24","v":{"v":2.00725,"d":"2.007"}},"kg/m³",0.0555,"EUR/kWh",{"$f":"P5","v":0.0555},{"$f":"VLOOKUP(\"EUR/kWh BTW excl\",Translations,LANG,FALSE)","v":"EUR/kWh HTVA"},{"$f":"R5*1.21","v":{"v":0.06715499999999999,"d":"0.0672"}},{"$f":"VLOOKUP(\"EUR/kWh BTW incl\",Translations,LANG,FALSE)","v":"EUR/kWh TVAc"},{"$f":"3.6/I5","v":{"v":0.9999999999999999,"d":"1.000"}},{"v":0.055499999999999994,"d":"0.0555"},"EUR/kWh HTVA",{"v":0.06715499999999999,"d":"0.0672"},"EUR/kWh TVAc",{"$f":"W5*((1+Hyp!D3)^25)/2","v":{"v":0.11550101864640695,"d":"0.12"}},{"$f":"Hyp!D3","v":0.0587}]
[{"$f":"VLOOKUP(\"4-Aardgas (WG)\",Translations,LANG,FALSE)","v":"4-Gaz naturel (RW)"},{"$f":"VLOOKUP(\"kWh/jaar\",Translations,LANG,FALSE)","v":"kWh/an"},{"$f":"'Tech Data'!G28","v":{"v":0.6061626536453948,"d":"0.61"}},{"$f":"'Tech Data'!G28","v":{"v":0.6061626536453948,"d":"0.61"}},{"$f":"'Tech Data'!G29","v":{"v":0.6954032665431892,"d":"0.70"}},{"$f":"'Tech Data'!G30","v":{"v":0.8832837435758722,"d":"0.88"}},{"$f":"'Energy Data'!B21","v":10.75},"kWh/m³",{"$f":"'Energy Data'!B23","v":3.6},{"$f":"J3","v":"MJ/kWh"},{"v":1,"d":"1.00"},{"$f":"'Energy Data'!D21","v":0.251},{"$f":"M3","v":"kg/kWh"},{"$f":"L6*'Energy Data'!B21","v":{"v":2.69825,"d":"2.698"}},"kg/m³",0.0555,{"$f":"Q3","v":"EUR/kWh"},{"$f":"P6","v":0.0555},{"$f":"VLOOKUP(\"EUR/kWh BTW excl\",Translations,LANG,FALSE)","v":"EUR/kWh HTVA"},{"$f":"R6*1.21","v":{"v":0.06715499999999999,"d":"0.0672"}},{"$f":"VLOOKUP(\"EUR/kWh BTW incl\",Translations,LANG,FALSE)","v":"EUR/kWh TVAc"},{"$f":"V3","v":{"v":1,"d":"1.000"}},0.0555,"EUR/kWh HTVA",{"v":0.06715499999999999,"d":"0.0672"},"EUR/kWh TVAc",{"$f":"W6*((1+Hyp!D3)^25)/2","v":{"v":0.11550101864640697,"d":"0.12"}},{"$f":"Hyp!D3","v":0.0587}]
[{"$f":"VLOOKUP(\"5-Houtpellets\",Translations,LANG,FALSE)","v":"5-Granulés de bois "},{"$f":"VLOOKUP(\"ton/jaar\",Translations,LANG,FALSE)","v":"tonnes/an"},{"$f":"'Tech Data'!G31","v":{"v":0.7687314038409521,"d":"0.77"}},{"$f":"'Tech Data'!G31","v":{"v":0.7687314038409521,"d":"0.77"}},{"$f":"'Tech Data'!G32","v":{"v":0.6230005051355447,"d":"0.62"}},{"$f":"'Tech Data'!G32","v":{"v":0.6230005051355447,"d":"0.62"}},{"$f":"'Energy Data'!B28","v":5.15},"kWh/kg",{"$f":"'Energy Data'!B28*'Energy Data'!D9","v":{"v":18.540000000000003,"d":"18.5"}},"MJ/kg",{"v":1,"d":"1.00"},{"$f":"'Energy Data'!D28","v":{"v":0.03,"d":"0.030"}},"kg/kWh",{"$f":"L7","v":{"v":0.03,"d":"0.030"}},"kg/kWh",{"$f":"R7/('Energy Data'!B28*1000)","v":{"v":0.04219331989985956,"d":"0.0422"}},"EUR/kWh",{"$f":"T7/1.06","v":{"v":217.29559748427673,"d":"217.2956"}},{"$f":"VLOOKUP(\"EUR/ton BTW excl\",Translations,LANG,FALSE)","v":"EUR/tonne HTVA"},{"$f":"AVERAGE(200,241,250)","v":{"v":230.33333333333334,"d":"230.3333"}},{"$f":"VLOOKUP(\"EUR/ton BTW incl\",Translations,LANG,FALSE)","v":"EUR/tonne TVAc"},{"$f":"1/('Energy Data'!B28*1000)","v":{"v":1.9417475728155341E-4,"d":"0.000"}},{"v":0.04219331989985956,"d":"0.0422"},"EUR/kWh HTVA",{"v":0.05105391707883007,"d":"0.0511"},"EUR/kWh TVAc",{"$f":"W7*((1+Hyp!D5)^25)/2","v":{"v":0.047045351797547465,"d":"0.05"}},{"$f":"Hyp!D5","v":0.0326}]
[{"$f":"VLOOKUP(\"6-Stookolie\",Translations,LANG,FALSE)","v":"6-Mazout"},{"$f":"VLOOKUP(\"l stookolie/jaar\",Translations,LANG,FALSE)","v":"l mazout/an"},{"$f":"'Tech Data'!G33","v":{"v":0.8473086286177982,"d":"0.85"}},{"$f":"'Tech Data'!G34","v":{"v":0.8615093318907221,"d":"0.86"}},{"$f":"'Tech Data'!G35","v":{"v":0.7071897625862941,"d":"0.71"}},{"$f":"'Tech Data'!G36","v":0.95},{"$f":"'Energy Data'!B19","v":9.94},"kWh/l",{"$f":"'Energy Data'!B20","v":{"v":35.87,"d":"35.9"}},"MJ/l",{"v":1,"d":"1.00"},{"$f":"'Energy Data'!D19","v":0.306},"kg/kWh",{"$f":"L8*'Energy Data'!B19","v":{"v":3.0416399999999997,"d":"3.042"}},"kg/l",{"$f":"T8/1.21","v":{"v":0.7382920110192837,"d":"0.7383"}},{"$f":"VLOOKUP(\"EUR/liter\",Translations,LANG,FALSE)","v":"EUR/litre"},{"$f":"P8","v":{"v":0.7382920110192837,"d":"0.7383"}},{"$f":"VLOOKUP(\"EUR/liter BTW excl\",Translations,LANG,FALSE)","v":"EUR/litre HTVA"},{"$f":"T40","v":{"v":0.8933333333333332,"d":"0.8933"}},{"$f":"VLOOKUP(\"EUR/liter BTW incl\",Translations,LANG,FALSE)","v":"EUR/litre TVAc"},{"$f":"1/'Energy Data'!B19","v":{"v":0.1006036217303823,"d":"0.101"}},{"v":0.07427485020314725,"d":"0.0743"},"EUR/kWh HTVA",{"v":0.08987256874580818,"d":"0.0899"},"EUR/kWh TVAc",{"$f":"W8*((1+Hyp!D4)^25)/2","v":{"v":0.08281610609950683,"d":"0.08"}},{"$f":"Hyp!D4","v":0.0326}]
[]
[null,null,"Default Price [EUR/kWh]","Prix moyen hyp High BFP [EUR/kWh]","Prix moyen hyp IBGE [EUR/kWh]"]
{"$rows_left_out":39}
{"sheet":"Calculs","index":10,"n_rows":37,"n_cols":8,"rows_kept":37,"hidden":true}
[]
["Descriptif Etablissement","Données Utilisateur","Estimations QuickScan","Unité"]
["TypeEtablissement",{"$f":"Tool!C32","v":"T-Bureau d'entreprise"},{"$f":"B3","v":"T-Bureau d'entreprise"}]
["N UniteFrequentation",{"$f":"Tool!C33","v":90},{"$f":"B4","v":90},{"$f":"Tool!D33","v":"Employés"}]
["Taux d'occupation",{"$f":"Tool!C35","v":100},{"$f":"IF(B5=0,1,B5/100)","v":{"v":1,"d":"100%"}}]
["Consommation ECS (Rratio)",null,{"$f":"C4*C5*LOOKUP(B3,TypeEtablissement,ConsoEtablissement)/1000","v":{"v":0.18,"d":"0.2"}},"m³/jour @60°C"]
[{"$nulls":5},"Description","Valeur","Unité"]
[{"$nulls":5},"Taux d'occupation par défaut",{"v":1,"d":"100%"}]
["Profil Consommation",{"$f":"Tool!H13","v":"A-7 jours sur 7 toute l'année"},{"$nulls":3},"Taux d'occupation minimum",{"v":0.2,"d":"20%"}]
["Consommation ECS introduite par Utilisateur",{"$f":"Tool!C49","v":500},null,{"$f":"Tool!D49","v":"m³/an"},null,"ConsoECS/Ratio = min",{"v":0.1,"d":"10%"}]
{"$rows_left_out":28}
{"sheet":"A-7sur7","index":11,"n_rows":42,"n_cols":11,"rows_kept":42,"hidden":true}
["DHWMDayVol",{"$f":"Tool!H12","v":{"v":1.36986301369863,"d":"1.4"}},null,null,"m³/j@60°C"]
["Days of SHW consumption ",{"$f":"52*7+1","v":365}]
["Resulting equations (A.HWMDayVol+B)"]
[null,"A","B","Result",null,null,"Contrainte en toiture"]
["Scoll",{"v":15.829,"d":"15.8290"},-3.7535,{"$f":"IF(B1=0,FALSE,B5*$B$1+C5)","v":{"v":17.930061643835618,"d":"17.9"}},"m²",null,"Scoll max",{"$f":"IF(Calculs!B36,\"\",Calculs!B37)","v":""},"m²"]
["Storage",1.0747,-0.1495,{"$f":"IF(B1=0,FALSE,B6*$B$1+C6)","v":{"v":1.3226917808219179,"d":"1.3"}},"m³"]
["Specific production",{"$f":"-0.6192","v":-0.6192},{"v":553.19,"d":"553.1900"},{"$f":"IF(B1=0,FALSE,B7*$B$1+C7)","v":{"v":552.3417808219178,"d":"552.3"}},"kWh/m².an"]
[]
["Simulation Results"]
["Qsol,net",{"$f":"D7*D5","v":{"v":9903.522178602929,"d":"9,904 "}},"kWh/an",{"$nulls":4},{"$f":"D7*H5","v":{"$error":"#VALUE!"}},"kWh/an"]
{"$rows_left_out":33}
{"sheet":"B-5sur7","index":12,"n_rows":42,"n_cols":11,"rows_kept":42,"hidden":true}
["DHWMDayVol",{"$f":"Tool!H12","v":{"v":1.36986301369863,"d":"1.4"}},null,null,"m³/j@60°C"]
["Days of SHW consumption ",{"$f":"52*(7-2)+1","v":261}]
["Resulting equations (A.HWMDayVol+B)"]
[null,"A","B","Result",null,null,"Contrainte en toiture"]
["Scoll",{"v":15.689,"d":"15.6890"},4.6157,{"$f":"IF(B1=0,FALSE,B5*$B$1+C5)","v":{"v":26.107480821917807,"d":"26.1"}},"m²",null,"Scoll max",{"$f":"IF(Calculs!B36,\"\",Calculs!B37)","v":""},"m²"]
["Storage",1.2775,0.0892,{"$f":"IF(B1=0,FALSE,B6*$B$1+C6)","v":{"v":1.8392,"d":"1.8"}},"m³"]
["Specific production",-0.1033,516.55,{"$f":"IF(B1=0,FALSE,B7*$B$1+C7)","v":{"v":516.4084931506849,"d":"516.4"}},"kWh/m².an"]
[]
["Simulation Results"]
["Qsol,net",{"$f":"D7*D5","v":{"v":13482.124831206978,"d":"13,482 "}},"kWh/an",{"$nulls":4},{"$f":"D7*H5","v":{"$error":"#VALUE!"}},"kWh/an"]
{"$rows_left_out":33}
{"sheet":"C-5sur7HVS","index":13,"n_rows":42,"n_cols":11,"rows_kept":42,"hidden":true}
["DHWMDayVol",{"$f":"Tool!H12","v":{"v":1.36986301369863,"d":"1.4"}},null,null,"m³/j@60°C"]
["Days of SHW consumption ",{"$f":"52*(7-2)+1-61","v":200}]
["Resulting equations (A.HWMDayVol+B)"]
[null,"A","B","Result",null,null,"Contrainte en toiture"]
["Scoll",{"v":15.564,"d":"15.5640"},9.2486,{"$f":"IF(B1=0,FALSE,B5*$B$1+C5)","v":{"v":30.56914794520548,"d":"30.6"}},"m²",null,"Scoll max",{"$f":"IF(Calculs!B36,\"\",Calculs!B37)","v":""},"m²"]
["Storage",1.2684,0.2473,{"$f":"IF(B1=0,FALSE,B6*$B$1+C6)","v":{"v":1.9848342465753424,"d":"2.0"}},"m³"]
["Specific production",0.4308,390.28,{"$f":"IF(B1=0,FALSE,B7*$B$1+C7)","v":{"v":390.87013698630136,"d":"390.9"}},"kWh/m².an"]
[]
["Simulation Results"]
["Qsol,net",{"$f":"D7*D5","v":{"v":11948.567044896978,"d":"11,949 "}},"kWh/an",{"$nulls":4},{"$f":"D7*H5","v":{"$error":"#VALUE!"}},"kWh/an"]
{"$rows_left_out":33}
{"sheet":"D-7sur7HVS","index":14,"n_rows":42,"n_cols":11,"rows_kept":42,"hidden":true}
["DHWMDayVol",{"$f":"Tool!H12","v":{"v":1.36986301369863,"d":"1.4"}},null,null,"m³/j@60°C"]
["Days of SHW consumption ",{"$f":"52*7+1-61","v":304}]
["Resulting equations (A.HWMDayVol+B)"]
[null,"A","B","Result",null,null,"Contrainte en toiture"]
["Scoll",{"v":10.956,"d":"10.9560"},3.6168,{"$f":"IF(B1=0,FALSE,B5*$B$1+C5)","v":{"v":18.62501917808219,"d":"18.6"}},"m²",null,"Scoll max",{"$f":"IF(Calculs!B36,\"\",Calculs!B37)","v":""},"m²"]
["Storage",{"v":0.746,"d":"0.7460"},0.2706,{"$f":"IF(B1=0,FALSE,B6*$B$1+C6)","v":{"v":1.292517808219178,"d":"1.3"}},"m³"]
["Specific production",0.3382,472.97,{"$f":"IF(B1=0,FALSE,B7*$B$1+C7)","v":{"v":473.4332876712329,"d":"473.4"}},"kWh/m².an"]
[]
["Simulation Results"]
["Qsol,net",{"$f":"D7*D5","v":{"v":8817.704062419216,"d":"8,818 "}},"kWh/an",{"$nulls":4},{"$f":"D7*H5","v":{"$error":"#VALUE!"}},"kWh/an"]
{"$rows_left_out":32}